Home > Make > Make *** Top.o Error 1

Make *** Top.o Error 1

Stop. Top Display posts from previous: All posts1 day7 days2 weeks1 month3 months6 months1 year Sort by AuthorPost timeSubject AscendingDescending Post Reply Print view 11 posts • Page 1 of 1 Return You'd want to add an SDIR variable (or similar) for that; make sure to remove the ../ on LDIR, IDIR and ODIR in that case. asked 1 year ago viewed 282 times active 1 year ago Blog How Do Software Developers in New York, San Francisco, London and Bangalore… Related 11How to speed up compilation of have a peek at this web-site

How to distinguish between American Indians and Indian Indians in native English (language) parlance? comment:2 follow-up: ↓ 3 Changed 2 years ago by paryasomayajulu Version of Mysys and minGw [email protected] /C/FFmpeg-master/FFmpeg-master $ gcc -v Reading specs from /usr/lib/gcc/i686-pc-msys/3.4.4/specs Configured with: /home/cstrauss/build/gcc3/gcc-3.4.4/configure --prefix=/usr --s ysconfdir=/etc --localstatedir=/var --infodir=/share/info From: Elena Zannoni Index Nav: [DateIndex] [SubjectIndex] [AuthorIndex] [ThreadIndex] Message Nav: [DatePrev][DateNext] [ThreadPrev][ThreadNext] UbuntuCommunityAsk!DeveloperDesignDiscourseHardwareInsightsJujuShopMore ›AppsHelpForumLaunchpadMAASCanonical current community chat Ask Ubuntu Ask Ubuntu Meta your communities Sign up or log in to more resources: javascript - Uncaught TypeError: Cannot read property 'top' of … - http://stackoverflow.com/questions/20175094/uncaught-typeerror-cannot-read-property-top-of-undefined Make *** Top.o Error 1 5 out of 5 based on 57 ratings. https://www.sourceware.org/ml/gdb/2002-06/msg00153.html

Blue Screen of Death (BSoD) This is a Make *** Top.o Error 1 that you might have ran into before. Top kaefert Posts: 19 Joined: 2013-12-10T05:50:03-07:00 Authentication code: 6789 Re: Make error on PerlMagick 6.8.6 Quote Postby kaefert » 2013-12-10T07:59:30-07:00 thanks! Top dtbaker61 Posts: 2 Joined: 2013-08-21T15:16:29-07:00 Authentication code: 6789 Re: Make error on PerlMagick 6.8.6 Quote Postby dtbaker61 » 2013-08-21T15:22:30-07:00 I am having a failed cpan install as well.... more stack exchange communities company blog Stack Exchange Inbox Reputation and Badges sign up log in tour help Tour Start here for a quick overview of the site Help Center Detailed

miRDeep on Bio Linux Hi, I've been trying to install miRDeep on Bio Linux but it keeps showing the following error me... Report message to a moderator Re: Error on Hello world itself! :( [message #1740543 is a reply to message #1740472] Mon, 15 August 2016 14:54 Jonah GrahamMessages: 131Registered: Is the equation pH+pOH=14 still valid at a different temperature? Also, it's just a college project and my professor wants the makefile and the code split between src, include and lib. –Eightbit Poe Jun 5 '15 at 2:30 Updated

Report message to a moderator Re: Error on Hello world itself! :( [message #666746 is a reply to message #665851] Fri, 22 April 2011 07:03 abhijeet.daemonMessages: 4Registered: April Install yasm, there is a Windows binary. ./libavutil/common.h:34:22: inttypes.h: No such file or directory This indicates a completely broken (and at least unsupported build environment. Not ideal, but it does what I need. https://root.cern.ch/phpBB3/viewtopic.php?t=4232 It has 7-pointed leaves How do dragons not burn themselves?

Download in other formats: Comma-delimited Text Tab-delimited Text RSS Feed Powered by Trac 1.0.1 By Edgewall Software. The process for finding TLS really should be tightly coupled with the actual dynamic linker and thread library in use, the way libthread_db is. Top [email protected] Posts: 1 Joined: 2013-11-19T10:48:04-07:00 Authentication code: 6789 Re: Make error on PerlMagick 6.8.6 Quote Postby [email protected] » 2013-11-19T13:50:52-07:00 I am getting the same error on FreeBSD 8.1.Code: Select allGoing BreakDancer make error ~/bin/breakdancer/build$make [ 14%] Built target boost-libs [ 28%] Built target samtools-lib [ 28...

Powered by: FUDforum 3.0.2.Copyright ©2001-2010 FUDforum Bulletin Board Software

Back to the top Eclipse Foundation About us Contact Us Donate Governance Logo and Artwork Board of Directors Legal Privacy Policy One objection was that this would embed knowledge about the implementation of TLS in the executable's debugging info. You can do such after you restart your computer. What can I do about a rock climbing ban?

on my Dell workstation (64bit) For this,we need to ... http://divxpl.net/make/make-size-before-error-255.html pay attention to the error prompting. But perhaps the Dwarf expression could actually get that from a GOT entry. Bambus:- Installation Error Dear all, i am new in the linux and want to install bambus standalone scaffolder but getting thi...

The way to find TLS can change depending on which dynamic linker and thread library you happen to be (dynamically) linking against. How come the Sun's gravity can hold distant planets in orbit, but cannot rip humans off Earth? DLL Files are Lost If you have an improperly installed program or a program missing file, it is more probably that this Make *** Top.o Error 1 will take place. Source There are individuals who find PC replacement as the best option for these errors.

You could create it automatically from the Makefile, but depending on what you want to do, a simple mkdir obj might be all you need. Back to the top Search: LoginPreferencesHelp/GuideAbout TracRegister WikiTimelineView TicketsSearchTags Context Navigation +0← Previous TicketNext Ticket → Opened 2 years ago Closed 2 years ago Last modified 2 years ago #3703 closed Not the answer you're looking for?

reads.cpp:327: instantiated from here SeqAn-1.1/seqan/basic/basic_alphabet_interface.h:353: no match for `* seqan::Iter, std::allocator >, seqan::StdIteratorAdaptor>&' operator make[2]: *** [reads.o] Error 1 make[2]: Leaving directory `/usr/local/tophat-1.2.0/src' make[1]: *** [all-recursive] Error 1 make[1]:

Join them; it only takes a minute: Sign up Makefile Fatal error: can't create obj/calc.o up vote 0 down vote favorite I'm trying to make a makefile for a simple calculator Some of the common reasons include mismatched PC module applications and driver problems. Was Harry's concern about Fleur's sister Gabrielle misplaced? The new error message is: make: *** No rule to make target `obj/libcalc.o', needed by `calc'.

Does your system have the `sbrk' system call? In any event, I downloaded the imagemagick source but the configure directory does not exist. All Rights Reserved. have a peek here Failure in Tophat fusion installation Hi , I am new to bioinformatics.

Mike Cleary writes: > /home/buildsys/source/toolchain/gdb/event-top.c:518: > `space_at_cmd_start' undecl > ared (first use in this function) > /home/buildsys/source/toolchain/gdb/event-top.c:518: (Each undeclared > identifier > is reported only once > /home/buildsys/source/toolchain/gdb/event-top.c:518: for each Did Pokemon start off as a Manga? Is there a name for this kind of comparator? From: Jim Blandy Re: GDB *** [event-top.o] Error 1!!

Next Message by Date: Re: GDB *** [event-top.o] Error 1!! Where are we expected to go with the Code: Select all./configure --with-perlcommand? Could you do make distclean make and if you still have an error, send the file config.status config.log and the full output of make Rene Top Display posts from previous: All Hot Network Questions How should a "working mathematician" think about sets? (ZFC, category theory, urelements) How to professionally handle sexist remarks by a student?

The dynamic linker doesn't assign the module a number until it's loaded. GBiz is too! Latest News Stories: Docker 1.0Heartbleed Redux: Another Gaping Wound in Web Encryption UncoveredThe Next Circle of Hell: Unpatchable SystemsGit 2.0.0 ReleasedThe Linux Foundation Announces Core Infrastructure that worked! What is this game from this promotional image for joysticks?

Visit the Trac open source project athttp://trac.edgewall.org/ Latest Open RNA-Seq ChIP-Seq SNP Assembly Tutorials Tools Jobs Forum Planet All » View Posts Latest Open RNA-Seq ChIP-Seq SNP Assembly Tutorials Tools The new error is: make: *** No rule to make target 'bj/libcalc.o', needed by 'calc'. Installing Vcftools And Architect Incompatibility ! how to make it work?

All Aboard the Kolmogorov Complexity Train How to format a number with an error? Previous Message by Thread: Compiling and running gdb on Tru64 Unix Hello All, I was hoping I could provide some feedback for other users or potential users of gdb on the install MIra 3.9.10 on Mac Hi I download MIRA 4 using brew on my mac but I got the following error. Recent Msgs:general/2016-11/msg28083.htmlweb2py/2016-11/msg00395.htmllibvir-list/2016-11/msg00985.htmlubuntu-bugs/2016-11/msg11224.htmlgeneral/2016-11/msg28039.htmlissues.maven.apache.org/2016-11/msg00678.htmlubuntu-bugs/2016-11/msg11256.htmlfedora-perl-devel/2016-11/msg01184.htmlbug-binutils-gnu/2016-11/msg00233.htmlgeneral/2016-11/msg28042.html Latest News Stories: Linux 4.0 Kernel Released Google Lets SMTP Certificate Expire Open Crypto Audit Passes TrueCrypt CIA 'tried to crack security of Apple devices' Xen Security Bug: Amazon,